BDBM27184 triazole-linked azithromycin-based compound, 16h
SMILES CC[C@H]1OC(=O)[C@H](C)[C@@H](O[C@H]2C[C@@](C)(OC)[C@@H](O)[C@H](C)O2)[C@H](C)[C@@H](O[C@@H]2O[C@H](C)C[C@@H]([C@H]2O)N(C)Cc2ccc(cc2)-c2cn(CCCCCCCCCC(=O)NO)nn2)[C@](C)(O)C[C@@H](C)CN(C)[C@H](C)[C@@H](O)[C@]1(C)O
InChI Key InChIKey=PVDBHHHRLSRBII-GJUNKSMQSA-N
Data  1 IC50
  Tab Delimited (TSV)   2D SDfile   Computed 3D by Vconf -m prep SDfile
Find this compound or compounds like it in BindingDB:
Activity Spreadsheet -- Enzyme Inhibition Constant Data from BindingDB
Found 1 hit for monomerid = 27184
TargetHistone deacetylase 1(Homo sapiens (Human))
Georgia Institute of Technology
LigandPNGBDBM27184(triazole-linked azithromycin-based compound, 16h)
Affinity DataIC50:  227nMpH: 8.0 T: 2°C. Assay description: The Fluor-de-Lys HDAC activity assay kit (Biomol) was used. Purified recombinant HDAC enzyme was incubated with Fluor-de-Lys substrate in the presenc...
In DepthDetails ArticlePubMed